Reaction Details
TargetRetinol-binding protein 4
LigandBDBM249466
Substrate/Competitorn/a
Meas. Tech.Scintillation Proximity Binding Assay
IC50 4.13±n/a nM
Citation Petrukhin, KCioffi, CJohnson, GAllikmets, RFreeman, EChen, PConlon, MZhu, L Substituted 4-phenylpiperidines, their preparation and use US Patent US9777010 Publication Date 10/3/2017
 
Retinol-binding protein 4
Name:Retinol-binding protein 4
Type:Protein
Mol. Mass.:23008.75
Organism:Homo sapiens (Human)
Description:P02753
Residue:201
BDBM249466
NameBDBM249466
Synonyms:US10072016, Compound 65 US10913746, Compound 65 US9434727, 65 | US9777010, Compound 65
TypeSmall organic molecule
Emp. Form.C20H15F4N5O
Mol. Mass.417.3596
SMILESFc1cccc(C2CCN(CC2)C(=O)c2nnc3ccc(cn23)C#N)c1C(F)(F)F