Reaction Details
TargetRetinol-binding protein 4
LigandBDBM249474
Substrate/Competitorn/a
Meas. Tech.Scintillation Proximity Binding Assay
IC50 2.88±n/a nM
Citation Petrukhin, KCioffi, CJohnson, GAllikmets, RFreeman, EChen, PConlon, MZhu, L Substituted 4-phenylpiperidines, their preparation and use US Patent US9777010 Publication Date 10/3/2017
 
Retinol-binding protein 4
Name:Retinol-binding protein 4
Type:Protein
Mol. Mass.:23008.75
Organism:Homo sapiens (Human)
Description:P02753
Residue:201
BDBM249474
NameBDBM249474
Synonyms:US10072016, Compound 77 US10913746, Compound 77 US9434727, 73 US9777010, Compound 77
TypeSmall organic molecule
Emp. Form.C22H26F4N4O2
Mol. Mass.454.4611
SMILESCOCCN1CCc2c(C1)[nH]nc2C(=O)N1CCC(CC1)c1cccc(F)c1C(F)(F)F