Reaction Details
TargetHigh affinity nerve growth factor receptor
LigandBDBM344200
Substrate/Competitorn/a
IC50 1.50±n/a nM
Citation Altenbach, RJLiu, HClapham, BAguirre, ALCowart, MKoenig, JRSarris, KScanio, MJSwinger, KKVasudevan, AVillamil, CIWoller, KR Furo-3-carboxamide derivatives and methods of use US Patent US9777020 Publication Date 10/3/2017
 
High affinity nerve growth factor receptor
Name:High affinity nerve growth factor receptor
Type:n/a
Mol. Mass.:87498.18
Organism:Homo sapiens (Human)
Description:P04629
Residue:796
BDBM344200
NameBDBM344200
Synonyms:(2R)-1-[3-{[6-(4-acetylpiperazin-1-yl)-2-ethoxypyridin-3-yl]carbamoyl}-4-oxo-6,7-dihydrofuro[3,2-c]pyridin-5(4H)-yl]propan-2-yl acetate | US9777020, Example 94
TypeSmall organic molecule
Emp. Form.C26H33N5O7
Mol. Mass.527.5695
SMILESCCOc1nc(ccc1NC(=O)c1coc2CCN(C[C@@H](C)OC(C)=O)C(=O)c12)N1CCN(CC1)C(C)=O