Reaction Details
TargetHigh affinity nerve growth factor receptor
LigandBDBM344241
Substrate/Competitorn/a
IC50 2.30±n/a nM
Citation Altenbach, RJLiu, HClapham, BAguirre, ALCowart, MKoenig, JRSarris, KScanio, MJSwinger, KKVasudevan, AVillamil, CIWoller, KR Furo-3-carboxamide derivatives and methods of use US Patent US9777020 Publication Date 10/3/2017
 
High affinity nerve growth factor receptor
Name:High affinity nerve growth factor receptor
Type:n/a
Mol. Mass.:87498.18
Organism:Homo sapiens (Human)
Description:P04629
Residue:796
BDBM344241
NameBDBM344241
Synonyms:N-{6-[(2S)-2-(hydroxymethyl)-4-(morpholin-4-ylcarbonyl)piperazin-1-yl]-2-isopropoxypyridin-3-yl}-6,6-dimethyl-4-oxo-4,5,6,7-tetrahydrofuro[3,2-c]pyridine-3-carboxamide | US9777020, Example 135
TypeSmall organic molecule
Emp. Form.C28H38N6O7
Mol. Mass.570.6373
SMILESCC(C)Oc1nc(ccc1NC(=O)c1coc2CC(C)(C)NC(=O)c12)N1CCN(C[C@H]1CO)C(=O)N1CCOCC1