Reaction Details
TargetHigh affinity nerve growth factor receptor
LigandBDBM344248
Substrate/Competitorn/a
IC50 1.80±n/a nM
Citation Altenbach, RJLiu, HClapham, BAguirre, ALCowart, MKoenig, JRSarris, KScanio, MJSwinger, KKVasudevan, AVillamil, CIWoller, KR Furo-3-carboxamide derivatives and methods of use US Patent US9777020 Publication Date 10/3/2017
 
High affinity nerve growth factor receptor
Name:High affinity nerve growth factor receptor
Type:n/a
Mol. Mass.:87498.18
Organism:Homo sapiens (Human)
Description:P04629
Residue:796
BDBM344248
NameBDBM344248
Synonyms:N-{6-[(3S)-4-acetyl-3-(methoxymethyl)piperazin-1-yl]-2-(2-hydroxy-2-methylpropoxy)pyridin-3-yl}-6,6-dimethyl-4-oxo-4,5,6,7-tetrahydrofuro[3,2-c]pyridine-3-carboxamide | US9777020, Example 142
TypeSmall organic molecule
Emp. Form.C27H37N5O7
Mol. Mass.543.612
SMILESCOC[C@@H]1CN(CCN1C(C)=O)c1ccc(NC(=O)c2coc3CC(C)(C)NC(=O)c23)c(OCC(C)(C)O)n1