Reaction Details
TargetHigh affinity nerve growth factor receptor
LigandBDBM344280
Substrate/Competitorn/a
IC50 5.20±n/a nM
Citation Altenbach, RJLiu, HClapham, BAguirre, ALCowart, MKoenig, JRSarris, KScanio, MJSwinger, KKVasudevan, AVillamil, CIWoller, KR Furo-3-carboxamide derivatives and methods of use US Patent US9777020 Publication Date 10/3/2017
 
High affinity nerve growth factor receptor
Name:High affinity nerve growth factor receptor
Type:n/a
Mol. Mass.:87498.18
Organism:Homo sapiens (Human)
Description:P04629
Residue:796
BDBM344280
NameBDBM344280
Synonyms:N-[6-(4-acetylpiperazin-1-yl)-2-ethoxypyridin-3-yl]-5-(2-hydroxyethyl)-6,6-dimethyl-4-oxo-4,5,6,7-tetrahydrofuro[3,2-c]pyridine-3-carboxamide | US9777020, Example 174
TypeSmall organic molecule
Emp. Form.C25H33N5O6
Mol. Mass.499.5594
SMILESCCOc1nc(ccc1NC(=O)c1coc2CC(C)(C)N(CCO)C(=O)c12)N1CCN(CC1)C(C)=O