Reaction Details
TargetNitric oxide synthase, inducible
LigandBDBM50330882
Substrate/Competitorn/a
Meas. Tech.Enzyme Assay
Ki 273±n/a nM
Citation Silverman, RBCinelli, MAPensa, AV 2-aminoquinoline-based compounds for potent and selective neuronal nitric oxide synthase inhibition US Patent US9783500 Publication Date 10/10/2017
 
Nitric oxide synthase, inducible
Name:Nitric oxide synthase, inducible
Type:Homodimer
Mol. Mass.:131141.95
Organism:Homo sapiens (Human)
Description:P35228
Residue:1153
BDBM50330882
NameBDBM50330882
Synonyms:CHEMBL1277951 N1-((3R,4R)-4-((6-aminopyridin-2-yl)methyl)pyrrolidin-3-yl)-N2-(4-fluorobenzyl)ethane-1,2-diamine tetrahydrochloride US9212144, 1 | US9783500, Compound 2
TypeSmall organic molecule
Emp. Form.C21H30FN5
Mol. Mass.371.4948
SMILESCc1cc(N)nc(C[C@@H]2CNC[C@@H]2NCCNCCc2cccc(F)c2)c1