Reaction Details
TargetNitric oxide synthase, brain
LigandBDBM344412
Substrate/Competitorn/a
Meas. Tech.Enzyme Assay
Ki 25.0±n/a nM
Citation Silverman, RBCinelli, MAPensa, AV 2-aminoquinoline-based compounds for potent and selective neuronal nitric oxide synthase inhibition US Patent US9783500 Publication Date 10/10/2017
 
Nitric oxide synthase, brain
Name:Nitric oxide synthase, brain
Type:Enzyme
Mol. Mass.:160570.98
Organism:Rattus norvegicus (rat)
Description:Recombinant nNOS overexpressed in E. coli was used in enzyme assays.
Residue:1429
BDBM344412
NameBDBM344412
Synonyms:US9783500, Compound 7
TypeSmall organic molecule
Emp. Form.C17H17N3O
Mol. Mass.279.3364
SMILESNCc1cccc(OCc2ccc3ccc(N)nc3c2)c1