Reaction Details
TargetMonocarboxylate transporter 4
LigandBDBM345258
Substrate/Competitorn/a
Meas. Tech.Lactate Transport in MCT4-Expressing MDA-MB-453 Breast Cancer Cells
IC50 68.0±n/a nM
Citation Parnell, KMMcCall, J MCT4 inhibitors for treating disease US Patent US10202350 Publication Date 2/12/2019
 
Monocarboxylate transporter 4
Name:Monocarboxylate transporter 4
Type:PROTEIN
Mol. Mass.:49474.36
Organism:Homo sapiens (Human)
Description:ChEMBL_104604
Residue:465
BDBM345258
NameBDBM345258
Synonyms:2-[[1-[(2-Chlorophenyl)methyl]-5-(4- fluorophenyl)pyrazol-3-yl]methoxy]-2- methyl-propanoic acid 1H NMR (CD3OD, 400 MHz) $#948; 1.51 (s, 6H), 4.58 (s, 2H), 5.40 (s, 2H), 6.55 (s, 1H), 6.70-6.78 (m, 1H), 7.14-7.18 (m, 2H), 7-20- 7.29 (m, 2H), 7.32-7.40 (m, 3H). US10214492, Example 4 US11724989, Example 4
TypeSmall organic molecule
Emp. Form.C21H20ClFN2O3
Mol. Mass.402.847
SMILESCC(C)(OCc1cc(-c2ccc(F)cc2)n(Cc2ccccc2Cl)n1)C(O)=O