Reaction Details
TargetMonocarboxylate transporter 4
LigandBDBM345282
Substrate/Competitorn/a
Meas. Tech.Assay 3: MCT4-Mediated Lactate Transport in MDA-MB-231 Breast Cancer Cells
IC50 12.0±n/a nM
Citation Parnell, KMMcCall, J MCT4 inhibitors for treating disease US Patent US10202350 Publication Date 2/12/2019
 
Monocarboxylate transporter 4
Name:Monocarboxylate transporter 4
Type:PROTEIN
Mol. Mass.:49474.36
Organism:Homo sapiens (Human)
Description:ChEMBL_104604
Residue:465
BDBM345282
NameBDBM345282
Synonyms:2-[[1-[(2-Chlorophenyl)methyl]-5-(3- ethoxyphenyl)pyrazol-3-yl]methoxy]-2- methyl-propanoic acid. 1HNMR (CDCl3): $#948; 1.34 (t, 3H),, 1.56 (s, 6H), 3.86 (q, 2H), 4.62 (s, 2H), 5.43 (s, 2H), 6.40 (s, 1H), 6.76-6.78 (m, 2H), 6.83- 6.85 (m, 1H), 6.89-6.91 (m, 1H), 7.19-7.28 (m, 3H), 7.33-7.35 (m, 1H). US10214492, Example 28 US11724989, Example 28
TypeSmall organic molecule
Emp. Form.C23H25ClN2O4
Mol. Mass.428.909
SMILESCCOc1cccc(c1)-c1cc(COC(C)(C)C(O)=O)nn1Cc1ccccc1Cl