Reaction Details
TargetMonocarboxylate transporter 4
LigandBDBM345289
Substrate/Competitorn/a
Meas. Tech.Assay 3: MCT4-Mediated Lactate Transport in MDA-MB-231 Breast Cancer Cells
IC50 5.20±n/a nM
Citation Parnell, KMMcCall, J MCT4 inhibitors for treating disease US Patent US10202350 Publication Date 2/12/2019
 
Monocarboxylate transporter 4
Name:Monocarboxylate transporter 4
Type:PROTEIN
Mol. Mass.:49474.36
Organism:Homo sapiens (Human)
Description:ChEMBL_104604
Residue:465
BDBM345289
NameBDBM345289
Synonyms:2-[[1-[(2-Chlorophenyl)methyl]-5-(3- isopropoxyphenyl)pyrazol-3-yl]methoxy]- 2-methyl-propanoic acid. 1HNMR (CDCl3): $#948; 1.22 (s, 3H)(, 1.23 (s, 3H), 1.55 (s, 6H), 4.30-4.33 (m, 1H), 4.62 (s, 2H), 5.43 (s, 2H), 6.41 (s, 1H), 6.75- 6.90 (4H), 7.19-7.35 (m, 4H). US10214492, Example 35 US11724989, Example 35
TypeSmall organic molecule
Emp. Form.C24H27ClN2O4
Mol. Mass.442.935
SMILESCC(C)Oc1cccc(c1)-c1cc(COC(C)(C)C(O)=O)nn1Cc1ccccc1Cl