Reaction Details
TargetMonocarboxylate transporter 4
LigandBDBM345292
Substrate/Competitorn/a
Meas. Tech.Assay 3: MCT4-Mediated Lactate Transport in MDA-MB-231 Breast Cancer Cells
IC50 48.0±n/a nM
Citation Parnell, KMMcCall, J MCT4 inhibitors for treating disease US Patent US10202350 Publication Date 2/12/2019
 
Monocarboxylate transporter 4
Name:Monocarboxylate transporter 4
Type:PROTEIN
Mol. Mass.:49474.36
Organism:Homo sapiens (Human)
Description:ChEMBL_104604
Residue:465
BDBM345292
NameBDBM345292
Synonyms:2-[[1-[[2-(Dimethylamino)phenyl]methyl]- 5-(3-methoxyphenyl)pyrazol-3- yl]methoxy]-2-methyl-propanoic acid. 1HNMR (CDCl3): $#948; 1.56 (s, 6H), 2.60 (s, 6H), 6.64 (s, 3H), 4.63 (s, 2H), 5.44 (s, 2H). 6.30 (s, 1H), 6.71-7.11 (m 6H), 7.20- 7.25 (m, 2H). US10214492, Example 38 US11724989, Example 38
TypeSmall organic molecule
Emp. Form.C24H29N3O4
Mol. Mass.423.5048
SMILESCOc1cccc(c1)-c1cc(COC(C)(C)C(O)=O)nn1Cc1ccccc1N(C)C