Reaction Details
TargetMonocarboxylate transporter 4
LigandBDBM345293
Substrate/Competitorn/a
Meas. Tech.Assay 3: MCT4-Mediated Lactate Transport in MDA-MB-231 Breast Cancer Cells
IC50 5.40±n/a nM
Citation Parnell, KMMcCall, J MCT4 inhibitors for treating disease US Patent US10202350 Publication Date 2/12/2019
 
Monocarboxylate transporter 4
Name:Monocarboxylate transporter 4
Type:PROTEIN
Mol. Mass.:49474.36
Organism:Homo sapiens (Human)
Description:ChEMBL_104604
Residue:465
BDBM345293
NameBDBM345293
Synonyms:2-[[1-[(2-Chlorophenyl)methyl]-5-[3- (cyclopropoxy)phenyl]pyrazol-3- yl]methoxy]-2-methyl-propanoic acid. 1HNMR (CDCl3): $#948; 0.55-0.68 (m 4H), 1.55 (s, 6H), 3.50-3.54 (m 1H), 4.63 (s, 2H), 5.44 (s, 2H), 6.42 (s, 1H), 6.76-7.02 (m, 4H), 7.17-7.35 (m, 4H). US10214492, Example 39 US11724989, Example 39
TypeSmall organic molecule
Emp. Form.C24H25ClN2O4
Mol. Mass.440.919
SMILESCC(C)(OCc1cc(-c2cccc(OC3CC3)c2)n(Cc2ccccc2Cl)n1)C(O)=O