Reaction Details
TargetMonocarboxylate transporter 4
LigandBDBM345322
Substrate/Competitorn/a
Meas. Tech.Assay 3: MCT4-Mediated Lactate Transport in MDA-MB-231 Breast Cancer Cells
IC50 9.10±n/a nM
Citation Parnell, KMMcCall, J MCT4 inhibitors for treating disease US Patent US10202350 Publication Date 2/12/2019
 
Monocarboxylate transporter 4
Name:Monocarboxylate transporter 4
Type:PROTEIN
Mol. Mass.:49474.36
Organism:Homo sapiens (Human)
Description:ChEMBL_104604
Residue:465
BDBM345322
NameBDBM345322
Synonyms:2-([1-[(2-Chlorophenyl)methyl]-5-(3-methoxyphenyl)-1H-pyrazol-3-yl]methoxy)-2-methylbutanoic Acid US10214492, Example 68 US11724989, Example 68
TypeSmall organic molecule
Emp. Form.C23H25ClN2O4
Mol. Mass.428.909
SMILESCCC(C)(OCc1cc(-c2cccc(OC)c2)n(Cc2ccccc2Cl)n1)C(O)=O