Reaction Details
TargetMonocarboxylate transporter 4
LigandBDBM345332
Substrate/Competitorn/a
Meas. Tech.Assay 3: MCT4-Mediated Lactate Transport in MDA-MB-231 Breast Cancer Cells
IC50 59.0±n/a nM
Citation Parnell, KMMcCall, J MCT4 inhibitors for treating disease US Patent US10202350 Publication Date 2/12/2019
 
Monocarboxylate transporter 4
Name:Monocarboxylate transporter 4
Type:PROTEIN
Mol. Mass.:49474.36
Organism:Homo sapiens (Human)
Description:ChEMBL_104604
Residue:465
BDBM345332
NameBDBM345332
Synonyms:2-[[1-[(2-Chlorophenyl)methyl]-5-(3-hydroxyphenyl)pyrazol-3-yl]methoxy]-2-methyl-propanoic Acid US10214492, Example 79 US11724989, Example 79
TypeSmall organic molecule
Emp. Form.C21H21ClN2O4
Mol. Mass.400.855
SMILESCC(C)(OCc1cc(-c2cccc(O)c2)n(Cc2ccccc2Cl)n1)C(O)=O