Reaction Details
TargetcGMP-inhibited 3',5'-cyclic phosphodiesterase 3A
LigandBDBM14762
Substrate/CompetitorBDBM10851
Meas. Tech.PDE Competitive Enzyme Inhibition Assay
Ki 199±n/a nM
Citation Chappie, TAHumphrey, JMAllen, MPEstep, KGFox, CBLebel, LALiras, SMarr, ESMenniti, FSPandit, JSchmidt, CJTu, MWilliams, RDYang, FV Discovery of a series of 6,7-dimethoxy-4-pyrrolidylquinazoline PDE10A inhibitors. J Med Chem50:182-5 (2007) 
 
cGMP-inhibited 3',5'-cyclic phosphodiesterase 3A
Name:cGMP-inhibited 3',5'-cyclic phosphodiesterase 3A
Type:Enzyme
Mol. Mass.:124966.46
Organism:Homo sapiens (Human)
Description:Q14432
Residue:1141
BDBM14762
BDBM10851
NameBDBM14762
Synonyms:(R)-6,7-Dimethoxy-4-[3-(6-methoxy-naphthalen-2-yloxy)-pyrrolidin-1-yl]-quinazoline 6,7-dimethoxy-4-[(3R)-3-[(6-methoxynaphthalen-2-yl)oxy]pyrrolidin-1-yl]quinazoline
TypeSmall organic molecule
Emp. Form.C25H25N3O4
Mol. Mass.431.4837
SMILESCOc1ccc2cc(O[C@@H]3CCN(C3)c3ncnc4cc(OC)c(OC)cc34)ccc2c1