Reaction Details
TargetCREB-binding protein
LigandBDBM349484
Substrate/Competitorn/a
Meas. Tech.CBP TR-FRET Binding Assay
IC50 4.00±n/a nM
Citation Romero, FAMagnuson, SRPastor, RTsui, VHMurray, JCrawford, TBurdick, DJAlbrecht, BKCote, ATaylor, AMNasveschuck, CGLeBlanc, YHewitt, MCLai, KWChen, K Therapeutic compounds and uses thereof US Patent US10206931 Publication Date 2/19/2019
 
CREB-binding protein
Name:CREB-binding protein
Type:Transcription Coactivator
Mol. Mass.:265411.66
Organism:Homo sapiens (Human)
Description:Q92793
Residue:2442
BDBM349484
NameBDBM349484
Synonyms:US10206931, Example 292 | oxo-1,3,4,5-tetrahydro-
TypeSmall organic molecule
Emp. Form.C24H26N6O
Mol. Mass.414.5028
SMILESCN\C=C(/C=N)c1cc2CCCN(c2cc1C#N)c1cccc2NC(=O)C[C@@H](C)Nc12