Reaction Details
TargetCREB-binding protein
LigandBDBM349491
Substrate/Competitorn/a
Meas. Tech.CBP TR-FRET Binding Assay
IC50 6.00±n/a nM
Citation Romero, FAMagnuson, SRPastor, RTsui, VHMurray, JCrawford, TBurdick, DJAlbrecht, BKCote, ATaylor, AMNasveschuck, CGLeBlanc, YHewitt, MCLai, KWChen, K Therapeutic compounds and uses thereof US Patent US10206931 Publication Date 2/19/2019
 
CREB-binding protein
Name:CREB-binding protein
Type:Transcription Coactivator
Mol. Mass.:265411.66
Organism:Homo sapiens (Human)
Description:Q92793
Residue:2442
BDBM349491
NameBDBM349491
Synonyms:(difluoromethyl)-2- | US10206931, Example 299
TypeSmall organic molecule
Emp. Form.C21H22F3N5O
Mol. Mass.417.4275
SMILESCN\C=C(/C=N)c1cc(F)c(Nc2cccc3NC(=O)C[C@@H](C)Nc23)cc1C(F)F