Reaction Details
TargetSigma intracellular receptor 2
LigandBDBM349506
Substrate/Competitorn/a
Meas. Tech.Competitive Radioligand Binding Assay 2
Ki 12.0±n/a nM
Citation Rishton, GMCatalano, SMLook, GC Isoindoline compositions and methods for treating neurodegenerative disease US Patent US10207991 Publication Date 2/19/2019
 
Sigma intracellular receptor 2
Name:Sigma intracellular receptor 2
Type:Protein
Mol. Mass.:20857.20
Organism:Homo sapiens (Human)
Description:Q5BJF2
Residue:176
BDBM349506
NameBDBM349506
Synonyms:US10207991, Ex. Cpd. No. 21 US11691947, Example 21
TypeSmall organic molecule
Emp. Form.C18H19F2N
Mol. Mass.287.347
SMILESC[C@H](CCc1ccc(F)cc1)N1Cc2cccc(F)c2C1