Reaction Details
TargetSigma intracellular receptor 2
LigandBDBM349517
Substrate/Competitorn/a
Meas. Tech.Competitive Radioligand Binding Assay 2
Ki 3.20±n/a nM
Citation Rishton, GMCatalano, SMLook, GC Isoindoline compositions and methods for treating neurodegenerative disease US Patent US10207991 Publication Date 2/19/2019
 
Sigma intracellular receptor 2
Name:Sigma intracellular receptor 2
Type:Protein
Mol. Mass.:20857.20
Organism:Homo sapiens (Human)
Description:Q5BJF2
Residue:176
BDBM349517
NameBDBM349517
Synonyms:US10207991, Ex. Cpd. No. 33 US11691947, Example 33
TypeSmall organic molecule
Emp. Form.C19H21F2N
Mol. Mass.301.3735
SMILESCC(C)(CCc1ccc(F)cc1)N1Cc2cccc(F)c2C1