Reaction Details
TargetSigma intracellular receptor 2
LigandBDBM349525
Substrate/Competitorn/a
Meas. Tech.Competitive Radioligand Binding Assay 2
Ki 38.0±n/a nM
Citation Rishton, GMCatalano, SMLook, GC Isoindoline compositions and methods for treating neurodegenerative disease US Patent US10207991 Publication Date 2/19/2019
 
Sigma intracellular receptor 2
Name:Sigma intracellular receptor 2
Type:Protein
Mol. Mass.:20857.20
Organism:Homo sapiens (Human)
Description:Q5BJF2
Residue:176
BDBM349525
NameBDBM349525
Synonyms:US10207991, Ex. Cpd. No. 41 US11691947, Example 41
TypeSmall organic molecule
Emp. Form.C22H24F4N2O3
Mol. Mass.440.4312
SMILESC[C@H](CCc1ccc(OC(=O)N(C)C)c(OC(F)(F)F)c1)N1Cc2cccc(F)c2C1