Reaction Details
TargetSigma non-opioid intracellular receptor 1
LigandBDBM349543
Substrate/Competitorn/a
Meas. Tech.Competitive Radioligand Binding Assay 2
Ki 10000±n/a nM
Citation Rishton, GMCatalano, SMLook, GC Isoindoline compositions and methods for treating neurodegenerative disease US Patent US10207991 Publication Date 2/19/2019
 
Sigma non-opioid intracellular receptor 1
Name:Sigma non-opioid intracellular receptor 1
Type:Enzyme Catalytic Domain
Mol. Mass.:25124.85
Organism:Homo sapiens (Human)
Description:Q99720
Residue:223
BDBM349543
NameBDBM349543
Synonyms:US10207991, Ex. Cpd. No. 59 US11691947, Example 59
TypeSmall organic molecule
Emp. Form.C26H36N2O3
Mol. Mass.424.5756
SMILESCN(C)C(=O)c1cccc2CN(Cc12)C(C)(C)CCc1ccc(O)c(OC(C)(C)C)c1