Reaction Details
TargetSigma intracellular receptor 2
LigandBDBM349551
Substrate/Competitorn/a
Meas. Tech.Competitive Radioligand Binding Assay 2
Ki 2.60±n/a nM
Citation Rishton, GMCatalano, SMLook, GC Isoindoline compositions and methods for treating neurodegenerative disease US Patent US10207991 Publication Date 2/19/2019
 
Sigma intracellular receptor 2
Name:Sigma intracellular receptor 2
Type:Protein
Mol. Mass.:20857.20
Organism:Homo sapiens (Human)
Description:Q5BJF2
Residue:176
BDBM349551
NameBDBM349551
Synonyms:US10207991, Ex. Cpd. No. 66 US11691947, Example 66
TypeSmall organic molecule
Emp. Form.C24H33NO4S
Mol. Mass.431.588
SMILESCC(C)(C)Oc1cc(CCC(C)(C)N2Cc3cccc(c3C2)S(C)(=O)=O)ccc1O