Reaction Details
TargetIntermediate conductance calcium-activated potassium channel protein 4
LigandBDBM205065
Substrate/Competitorn/a
Meas. Tech.Inhibition Assay
pH7.3±n/a
IC50 58.0±0 nM
Commentsextracted
Citation Demnitz, JJorgensen, S Tetrazole derivatives and their use as potassium channel modulators US Patent US9556132 Publication Date 1/31/2017
 
Intermediate conductance calcium-activated potassium channel protein 4
Name:Intermediate conductance calcium-activated potassium channel protein 4
Type:PROTEIN
Mol. Mass.:47723.22
Organism:Homo sapiens (Human)
Description:ChEMBL_1361891
Residue:427
BDBM205065
NameBDBM205065
Synonyms:US9556132, 29 | process for preparing 1-(2-fluorophenyl)-5-{2-[2-(methoxymethyl)phenyl]phenyl}-1h-1,2,3,4-tetrazole
TypeSmall organic molecule
Emp. Form.C21H17FN4O
Mol. Mass.360.3843
SMILESCOCc1ccccc1-c1ccccc1-c1nnnn1-c1ccccc1F