Reaction Details
TargetIntermediate conductance calcium-activated potassium channel protein 4
LigandBDBM205069
Substrate/Competitorn/a
Meas. Tech.Inhibition Assay
pH7.3±n/a
IC50 17.0±0 nM
Commentsextracted
Citation Demnitz, JJorgensen, S Tetrazole derivatives and their use as potassium channel modulators US Patent US9556132 Publication Date 1/31/2017
 
Intermediate conductance calcium-activated potassium channel protein 4
Name:Intermediate conductance calcium-activated potassium channel protein 4
Type:PROTEIN
Mol. Mass.:47723.22
Organism:Homo sapiens (Human)
Description:ChEMBL_1361891
Residue:427
BDBM205069
NameBDBM205069
Synonyms:US9556132, 33 | process for preparing 5-{2-[2-(fluoromethyl)phenyl]phenyl}-1-(2-fluorophenyl)-1h-1,2,3,4-tetrazole
TypeSmall organic molecule
Emp. Form.C20H14F2N4
Mol. Mass.348.3488
SMILESFCc1ccccc1-c1ccccc1-c1nnnn1-c1ccccc1F