Reaction Details
TargetIntermediate conductance calcium-activated potassium channel protein 4
LigandBDBM205077
Substrate/Competitorn/a
Meas. Tech.Inhibition Assay
pH7.3±n/a
IC50 64.0±0 nM
Commentsextracted
Citation Demnitz, JJorgensen, S Tetrazole derivatives and their use as potassium channel modulators US Patent US9556132 Publication Date 1/31/2017
 
Intermediate conductance calcium-activated potassium channel protein 4
Name:Intermediate conductance calcium-activated potassium channel protein 4
Type:PROTEIN
Mol. Mass.:47723.22
Organism:Homo sapiens (Human)
Description:ChEMBL_1361891
Residue:427
BDBM205077
NameBDBM205077
Synonyms:US9556132, 56 | process for preparing 2-{5-[2-(2-methoxyphenyl)phenyl]-1h-1,2,3,4-tetrazol-1-yl}benzonitrile
TypeSmall organic molecule
Emp. Form.C21H15N5O
Mol. Mass.353.3767
SMILESCOc1ccccc1-c1ccccc1-c1nnnn1-c1ccccc1C#N