Reaction Details
TargetP2X purinoceptor 2/3
LigandBDBM320059
Substrate/Competitorn/a
Meas. Tech.Intracellular Calcium Measurement to Assess Antagonist Activity
IC50 59.0±n/a nM
Citation Davenport, AJBräuer, NFischer, OMRotgeri, ARottmann, ANeagoe, INagel, JGodinho-Coelho, AKlar, J 1,3-thiazol-2-yl substituted benzamides US Patent US10202369 Publication Date 2/12/2019
 
P2X purinoceptor 2/3
Name:P2X purinoceptor 2/3
Type:Protein
Mol. Mass.:n/a
Description:n/a
Components:This complex has 2 components.
Component 1
Name:P2X purinoceptor 2
Synonyms:ATP receptor P2RX2_HUMAN Purinergic receptor | PurinergicP2X2/3
Type:Enzyme Catalytic Domain
Mol. Mass.:51765.18
Organism:Homo sapiens (Human)
Description:PurinergicP2X2/3 0 HUMAN::Q9UBL9
Residue:471
Component 2
Name:P2X purinoceptor 3
Synonyms:ATP receptor P2RX3 P2X purinoceptor 3 P2X purinoceptor 3 (P2X3) P2X3 purinoceptor p2x3 + hsa
Type:Protein
Mol. Mass.:44292.02
Organism:Homo sapiens (Human)
Description:P56373
Residue:397
BDBM320059
NameBDBM320059
Synonyms:Methyl 4-[3-(5-methyl-1,3-thiazol-2-yl)-5-({(1R)-1-[2-(trifluoromethyl)pyrimidin-5-yl]ethyl}carbamoyl)phenoxy]piperidine-1-carboxylate US10202369, Example 226 | US10472354, Example 226
TypeSmall organic molecule
Emp. Form.C25H26F3N5O4S
Mol. Mass.549.565
SMILESCOC(=O)N1CCC(CC1)Oc1cc(cc(c1)-c1ncc(C)s1)C(=O)N[C@H](C)c1cnc(nc1)C(F)(F)F