Reaction Details
TargetCytochrome P450 2D6
LigandBDBM320165
Substrate/Competitorn/a
Meas. Tech.CYP Inhibition Assay
IC50>20000±n/a nM
Citation Davenport, AJBräuer, NFischer, OMRotgeri, ARottmann, ANeagoe, INagel, JGodinho-Coelho, AKlar, J 1,3-thiazol-2-yl substituted benzamides US Patent US10202369 Publication Date 2/12/2019
 
Cytochrome P450 2D6
Name:Cytochrome P450 2D6
Type:Protein
Mol. Mass.:55774.82
Organism:Homo sapiens (Human)
Description:P10635
Residue:497
BDBM320165
NameBDBM320165
Synonyms:3-[(3-methyltetrahydrofuran-3-yl)methoxy]-5-(5-methyl-1,3-thiazol-2-yl)-N-{(1R)-1-[2-(trifluoromethyl)pyrimidin-5-yl]ethyl}benzamide, as a Mixture of Two Diastereoisomers US10202369, Example 333
TypeSmall organic molecule
Emp. Form.C24H25F3N4O3S
Mol. Mass.506.541
SMILESC[C@@H](NC(=O)c1cc(OCC2(C)CCOC2)cc(c1)-c1ncc(C)s1)c1cnc(nc1)C(F)(F)F