Reaction Details
TargetCytochrome P450 2C9
LigandBDBM320017
Substrate/Competitorn/a
Meas. Tech.CYP Inhibition Assay
IC50>20000±n/a nM
Citation Davenport, AJBräuer, NFischer, OMRotgeri, ARottmann, ANeagoe, INagel, JGodinho-Coelho, AKlar, J 1,3-thiazol-2-yl substituted benzamides US Patent US10202369 Publication Date 2/12/2019
 
Cytochrome P450 2C9
Name:Cytochrome P450 2C9
Type:Enzyme
Mol. Mass.:55636.33
Organism:Homo sapiens (Human)
Description:P11712
Residue:490
BDBM320017
NameBDBM320017
Synonyms:Trans Isomer 1; 3- (5-chloro-1,3- thiazol-2-yl)-5-{[3- hydroxybutan-2- yl]oxy}-N-{(1R)-1- [2-(trifluoromethyl) pyrimidin-5-yl]ethyl} benzamide US10174016, Example 185 US10174016, Example 188 US10472354, Example 188
TypeSmall organic molecule
Emp. Form.C21H20ClF3N4O3S
Mol. Mass.500.922
SMILESCC(O)C(C)Oc1cc(cc(c1)-c1ncc(Cl)s1)C(=O)N[C@H](C)c1cnc(nc1)C(F)(F)F