Reaction Details
TargetMast/stem cell growth factor receptor Kit
LigandBDBM346024
Substrate/Competitorn/a
Meas. Tech.In Vitro TK Inhibition Assay
EC50<1000±n/a nM
Citation Moussy, ABenjahad, ASchalon, CPez, DChevenier, ESandrinelli, FMartin, JPicoul, W Benzimidazole derivatives as selective proteine kinase inhibitors US Patent US10202370 Publication Date 2/12/2019
 
Mast/stem cell growth factor receptor Kit
Name:Mast/stem cell growth factor receptor Kit
Type:Protein
Mol. Mass.:109869.37
Organism:Homo sapiens (Human)
Description:P10721
Residue:976
BDBM346024
NameBDBM346024
Synonyms:US10202370, Example 029 | [6-Methyl-2-(3- pyrrolidin-1-ylmethyl- 5-trifluoromethyl- phenyl)-3H- benzoimidazol-5-yl]- (4-pyridin-3-yl- pyrimidin-2-yl)- amine
TypeSmall organic molecule
Emp. Form.C29H26F3N7
Mol. Mass.529.5588
SMILESCc1cc2nc([nH]c2cc1Nc1nccc(n1)-c1cccnc1)-c1cc(CN2CCCC2)cc(c1)C(F)(F)F