Reaction Details
TargetMast/stem cell growth factor receptor Kit
LigandBDBM346032
Substrate/Competitorn/a
Meas. Tech.In Vitro TK Inhibition Assay
EC50<1000±n/a nM
Citation Moussy, ABenjahad, ASchalon, CPez, DChevenier, ESandrinelli, FMartin, JPicoul, W Benzimidazole derivatives as selective proteine kinase inhibitors US Patent US10202370 Publication Date 2/12/2019
 
Mast/stem cell growth factor receptor Kit
Name:Mast/stem cell growth factor receptor Kit
Type:Protein
Mol. Mass.:109869.37
Organism:Homo sapiens (Human)
Description:P10721
Residue:976
BDBM346032
NameBDBM346032
Synonyms:US10202370, Example 045 | [2-(3-Difluoromethyl- phenyl)-6-methyl- 3H-benzoimidazol-5- yl]-(4-pyridin-4-yl- thiazol-2-yl)-amine
TypeSmall organic molecule
Emp. Form.C23H17F2N5S
Mol. Mass.433.476
SMILESCc1cc2nc([nH]c2cc1Nc1nc(cs1)-c1ccncc1)-c1cccc(c1)C(F)F