Reaction Details
TargetMast/stem cell growth factor receptor Kit
LigandBDBM346039
Substrate/Competitorn/a
Meas. Tech.In Vitro TK Inhibition Assay
EC50<1000±n/a nM
Citation Moussy, ABenjahad, ASchalon, CPez, DChevenier, ESandrinelli, FMartin, JPicoul, W Benzimidazole derivatives as selective proteine kinase inhibitors US Patent US10202370 Publication Date 2/12/2019
 
Mast/stem cell growth factor receptor Kit
Name:Mast/stem cell growth factor receptor Kit
Type:Protein
Mol. Mass.:109869.37
Organism:Homo sapiens (Human)
Description:P10721
Residue:976
BDBM346039
NameBDBM346039
Synonyms:US10202370, Example 061 | [2-(3-Difluoromethyl- phenyl)-6-methyl- 3H-benzoimidazol-5- yl]-(4-pyrimidin-5-yl- thiazol-2-yl)-amine
TypeSmall organic molecule
Emp. Form.C22H16F2N6S
Mol. Mass.434.464
SMILESCc1cc2nc([nH]c2cc1Nc1nc(cs1)-c1cncnc1)-c1cccc(c1)C(F)F