Reaction Details
TargetMast/stem cell growth factor receptor Kit
LigandBDBM346074
Substrate/Competitorn/a
Meas. Tech.In Vitro TK Inhibition Assay
EC50<1000±n/a nM
Citation Moussy, ABenjahad, ASchalon, CPez, DChevenier, ESandrinelli, FMartin, JPicoul, W Benzimidazole derivatives as selective proteine kinase inhibitors US Patent US10202370 Publication Date 2/12/2019
 
Mast/stem cell growth factor receptor Kit
Name:Mast/stem cell growth factor receptor Kit
Type:Protein
Mol. Mass.:109869.37
Organism:Homo sapiens (Human)
Description:P10721
Residue:976
BDBM346074
NameBDBM346074
Synonyms:4-[2-(1,6-Dimethyl-2- m-tolyl-1H- benzoimidazol-5- ylamino)-thiazol-4- yl]-benzonitrile | US10202370, Example 112
TypeSmall organic molecule
Emp. Form.C26H21N5S
Mol. Mass.435.543
SMILESCc1cccc(c1)-c1nc2cc(Nc3nc(cs3)-c3ccc(cc3)C#N)c(C)cc2n1C