Reaction Details
TargetMast/stem cell growth factor receptor Kit
LigandBDBM346076
Substrate/Competitorn/a
Meas. Tech.In Vitro TK Inhibition Assay
EC50<1000±n/a nM
Citation Moussy, ABenjahad, ASchalon, CPez, DChevenier, ESandrinelli, FMartin, JPicoul, W Benzimidazole derivatives as selective proteine kinase inhibitors US Patent US10202370 Publication Date 2/12/2019
 
Mast/stem cell growth factor receptor Kit
Name:Mast/stem cell growth factor receptor Kit
Type:Protein
Mol. Mass.:109869.37
Organism:Homo sapiens (Human)
Description:P10721
Residue:976
BDBM346076
NameBDBM346076
Synonyms:US10202370, Example 115 | [1-Ethyl-6-methyl-2- (3-trifluoromethoxy- phenyl)-1H- benzoimidazol-5-yl]- (4-pyridin-3-yl- thiazol-2-yl)-amine
TypeSmall organic molecule
Emp. Form.C25H20F3N5OS
Mol. Mass.495.519
SMILESCCn1c(nc2cc(Nc3nc(cs3)-c3cccnc3)c(C)cc12)-c1cccc(OC(F)(F)F)c1