Reaction Details
TargetMast/stem cell growth factor receptor Kit
LigandBDBM346104
Substrate/Competitorn/a
Meas. Tech.In Vitro TK Inhibition Assay
EC50<1000±n/a nM
Citation Moussy, ABenjahad, ASchalon, CPez, DChevenier, ESandrinelli, FMartin, JPicoul, W Benzimidazole derivatives as selective proteine kinase inhibitors US Patent US10202370 Publication Date 2/12/2019
 
Mast/stem cell growth factor receptor Kit
Name:Mast/stem cell growth factor receptor Kit
Type:Protein
Mol. Mass.:109869.37
Organism:Homo sapiens (Human)
Description:P10721
Residue:976
BDBM346104
NameBDBM346104
Synonyms:US10202370, Example 150 | [2-(3-Isopropyl- phenyl)-6-methyl- 1H-benzoimidazol-5- yl]-(4-pyridin-4-yl- thiazol-2-yl)-amine
TypeSmall organic molecule
Emp. Form.C25H23N5S
Mol. Mass.425.549
SMILESCC(C)c1cccc(c1)-c1nc2cc(Nc3nc(cs3)-c3ccncc3)c(C)cc2[nH]1