Reaction Details
TargetProto-oncogene Wnt-1
LigandBDBM346270
Substrate/Competitorn/a
Meas. Tech.The screening assay for Wnt activity
IC50 42.4±n/a nM
Citation KC, SKWallace, DMCao, JChiruta, CHood, J 3-(1H-benzo[D]imidazol-2-yl)-1H-pyrazolo[3,4-C]pyridine and therapeutic uses thereof US Patent US10202377 Publication Date 2/12/2019
 
Proto-oncogene Wnt-1
Name:Proto-oncogene Wnt-1
Type:Enzyme Catalytic Domain
Mol. Mass.:41006.01
Organism:Homo sapiens (human)
Description:P04628
Residue:370
BDBM346270
NameBDBM346270
Synonyms:US10202377, Compound 7
TypeSmall organic molecule
Emp. Form.C26H20FN7
Mol. Mass.449.4823
SMILESCN(C)c1cncc(c1)-c1cc2c(n[nH]c2cn1)-c1nc2c(cccc2[nH]1)-c1cccc(F)c1