Reaction Details
TargetProto-oncogene Wnt-1
LigandBDBM346354
Substrate/Competitorn/a
Meas. Tech.The screening assay for Wnt activity
IC50 28.5±n/a nM
Citation KC, SKWallace, DMCao, JChiruta, CHood, J 3-(1H-benzo[D]imidazol-2-yl)-1H-pyrazolo[3,4-C]pyridine and therapeutic uses thereof US Patent US10202377 Publication Date 2/12/2019
 
Proto-oncogene Wnt-1
Name:Proto-oncogene Wnt-1
Type:Enzyme Catalytic Domain
Mol. Mass.:41006.01
Organism:Homo sapiens (human)
Description:P04628
Residue:370
BDBM346354
NameBDBM346354
Synonyms:US10202377, Compound 433
TypeSmall organic molecule
Emp. Form.C30H27FN8O3S
Mol. Mass.598.651
SMILESCCCC(=O)Nc1cncc(c1)-c1cc2c(n[nH]c2cn1)-c1nc2c(cccc2[nH]1)-c1cc(F)cc(CNS(C)(=O)=O)c1