Reaction Details
TargetTranscription initiation factor TFIID subunit 1
LigandBDBM346730
Substrate/Competitorn/a
Meas. Tech.CPE Inhibitory Effect Confirming Assay
IC50 21.0±n/a nM
Citation Takahashi, CMikamiyama, HAkiyama, TTomita, KTaoda, YKawai, MAnan, KMiyagawa, M Substituted polycyclic carbamoyl pyridone derivative prodrug US Patent US10202379 Publication Date 2/12/2019
 
Transcription initiation factor TFIID subunit 1
Name:Transcription initiation factor TFIID subunit 1
Type:PROTEIN
Mol. Mass.:212598.75
Organism:Homo sapiens (Human)
Description:ChEMBL_108248
Residue:1872
BDBM346730
NameBDBM346730
Synonyms:US10202379, Reference Example 333
TypeSmall organic molecule
Emp. Form.C24H22ClN3O4S
Mol. Mass.483.967
SMILESCOCCN1CN(C2c3ccccc3CSc3ccc(Cl)cc23)n2ccc(=O)c(O)c2C1=O