Reaction Details
TargetTranscription initiation factor TFIID subunit 1
LigandBDBM346812
Substrate/Competitorn/a
Meas. Tech.CPE Inhibitory Effect Confirming Assay
IC50 16.0±n/a nM
Citation Takahashi, CMikamiyama, HAkiyama, TTomita, KTaoda, YKawai, MAnan, KMiyagawa, M Substituted polycyclic carbamoyl pyridone derivative prodrug US Patent US10202379 Publication Date 2/12/2019
 
Transcription initiation factor TFIID subunit 1
Name:Transcription initiation factor TFIID subunit 1
Type:PROTEIN
Mol. Mass.:212598.75
Organism:Homo sapiens (Human)
Description:ChEMBL_108248
Residue:1872
BDBM346812
NameBDBM346812
Synonyms:US10202379, Reference Example 429
TypeSmall organic molecule
Emp. Form.C24H19ClF3N3O3S
Mol. Mass.521.939
SMILESC[C@@H](N1CN([C@@H]2c3ccccc3SCc3cccc(Cl)c23)n2ccc(=O)c(O)c2C1=O)C(F)(F)F