Reaction Details
TargetTranscription initiation factor TFIID subunit 1
LigandBDBM346970
Substrate/Competitorn/a
Meas. Tech.CPE Inhibitory Effect Confirming Assay
IC50 11.1±n/a nM
Citation Takahashi, CMikamiyama, HAkiyama, TTomita, KTaoda, YKawai, MAnan, KMiyagawa, M Substituted polycyclic carbamoyl pyridone derivative prodrug US Patent US10202379 Publication Date 2/12/2019
 
Transcription initiation factor TFIID subunit 1
Name:Transcription initiation factor TFIID subunit 1
Type:PROTEIN
Mol. Mass.:212598.75
Organism:Homo sapiens (Human)
Description:ChEMBL_108248
Residue:1872
BDBM346970
NameBDBM346970
Synonyms:US10202379, Reference Example 704
TypeSmall organic molecule
Emp. Form.C25H20F5N3O3S
Mol. Mass.537.502
SMILESC[C@@H](N1CN([C@@H]2c3ccccc3SCc3c(F)c(F)ccc23)n2cc(C)c(=O)c(O)c2C1=O)C(F)(F)F