Reaction Details
TargetTranscription initiation factor TFIID subunit 1
LigandBDBM346978
Substrate/Competitorn/a
Meas. Tech.CPE Inhibitory Effect Confirming Assay
IC50 5.54±n/a nM
Citation Takahashi, CMikamiyama, HAkiyama, TTomita, KTaoda, YKawai, MAnan, KMiyagawa, M Substituted polycyclic carbamoyl pyridone derivative prodrug US Patent US10202379 Publication Date 2/12/2019
 
Transcription initiation factor TFIID subunit 1
Name:Transcription initiation factor TFIID subunit 1
Type:PROTEIN
Mol. Mass.:212598.75
Organism:Homo sapiens (Human)
Description:ChEMBL_108248
Residue:1872
BDBM346978
NameBDBM346978
Synonyms:US10202379, Reference Example 716
TypeSmall organic molecule
Emp. Form.C24H17ClF5N3O3S
Mol. Mass.557.92
SMILESC[C@@H](N1CN([C@@H]2c3ccccc3SCc3c(F)c(F)ccc23)n2cc(Cl)c(=O)c(O)c2C1=O)C(F)(F)F