Reaction Details
TargetTranscription initiation factor TFIID subunit 1
LigandBDBM346987
Substrate/Competitorn/a
Meas. Tech.CPE Inhibitory Effect Confirming Assay
IC50 5.76±n/a nM
Citation Takahashi, CMikamiyama, HAkiyama, TTomita, KTaoda, YKawai, MAnan, KMiyagawa, M Substituted polycyclic carbamoyl pyridone derivative prodrug US Patent US10202379 Publication Date 2/12/2019
 
Transcription initiation factor TFIID subunit 1
Name:Transcription initiation factor TFIID subunit 1
Type:PROTEIN
Mol. Mass.:212598.75
Organism:Homo sapiens (Human)
Description:ChEMBL_108248
Residue:1872
BDBM346987
NameBDBM346987
Synonyms:US10202379, Reference Example 731
TypeSmall organic molecule
Emp. Form.C26H24F3N3O3S
Mol. Mass.515.547
SMILESCCc1cccc2CSc3ccccc3[C@@H](N3CN([C@H](C)C(F)(F)F)C(=O)c4c(O)c(=O)ccn34)c12