Reaction Details
TargetUbiquitin-like modifier-activating enzyme 1
LigandBDBM329809
Substrate/Competitorn/a
Meas. Tech.Ubiquitin Activating Enzyme (UAE) HTRF Assay
IC50<10±n/a nM
Citation Afroze, RBharathan, ITCiavarri, JPFleming, PEGaulin, JLGirard, MLangston, SPSoucy, FWong, TYe, Y Pyrazolopyrimidinyl inhibitors of ubiquitin-activating enzyme US Patent US10202389 Publication Date 2/12/2019
 
Ubiquitin-like modifier-activating enzyme 1
Name:Ubiquitin-like modifier-activating enzyme 1
Type:PROTEIN
Mol. Mass.:117834.03
Organism:Homo sapiens (Human)
Description:ChEMBL_827630
Residue:1058
BDBM329809
NameBDBM329809
Synonyms:(rac)-((1R,2R,3S,4R)-2,3-Dihydroxy-4-((2-(quinolin-8-yl)pyrazolo[1,5-a]pyrimidin-7- US9663525, Compound I-017 | US9796725, Compound I-017
TypeSmall organic molecule
Emp. Form.C21H22N6O5S
Mol. Mass.470.502
SMILESNS(=O)(=O)OC[C@H]1C[C@@H](Nc2ccnc3cc(nn23)-c2cccc3cccnc23)[C@H](O)[C@@H]1O