Reaction Details
TargetUbiquitin-like modifier-activating enzyme 1
LigandBDBM329833
Substrate/Competitorn/a
Meas. Tech.Ubiquitin Activating Enzyme (UAE) HTRF Assay
IC50<10±n/a nM
Citation Afroze, RBharathan, ITCiavarri, JPFleming, PEGaulin, JLGirard, MLangston, SPSoucy, FWong, TYe, Y Pyrazolopyrimidinyl inhibitors of ubiquitin-activating enzyme US Patent US10202389 Publication Date 2/12/2019
 
Ubiquitin-like modifier-activating enzyme 1
Name:Ubiquitin-like modifier-activating enzyme 1
Type:PROTEIN
Mol. Mass.:117834.03
Organism:Homo sapiens (Human)
Description:ChEMBL_827630
Residue:1058
BDBM329833
NameBDBM329833
Synonyms:(rac)-((1R,2R,3S,4R)-4-(2-(3,3-dimethyl-2,3-dihydro-1H-inden-5-yl)pyrazolo[1,5- US9663525, Compound I-041 | US9796725, Compound I-041
TypeSmall organic molecule
Emp. Form.C23H29N5O5S
Mol. Mass.487.572
SMILESCC1(C)CCc2ccc(cc12)-c1cc2nccc(N[C@@H]3C[C@H](COS(N)(=O)=O)[C@@H](O)[C@H]3O)n2n1