Reaction Details
TargetUbiquitin-like modifier-activating enzyme 1
LigandBDBM329845
Substrate/Competitorn/a
Meas. Tech.Ubiquitin Activating Enzyme (UAE) HTRF Assay
IC50<10±n/a nM
Citation Afroze, RBharathan, ITCiavarri, JPFleming, PEGaulin, JLGirard, MLangston, SPSoucy, FWong, TYe, Y Pyrazolopyrimidinyl inhibitors of ubiquitin-activating enzyme US Patent US10202389 Publication Date 2/12/2019
 
Ubiquitin-like modifier-activating enzyme 1
Name:Ubiquitin-like modifier-activating enzyme 1
Type:PROTEIN
Mol. Mass.:117834.03
Organism:Homo sapiens (Human)
Description:ChEMBL_827630
Residue:1058
BDBM329845
NameBDBM329845
Synonyms:(rac)-((1R,2R,3S,4R)-4-(2-(3,3-dimethyl-1,3-dihydroisobenzofuran-5- US9663525, Compound I-053 | US9796725, Compound I-053
TypeSmall organic molecule
Emp. Form.C22H27N5O6S
Mol. Mass.489.545
SMILESCC1(C)OCc2ccc(cc12)-c1cc2nccc(N[C@@H]3C[C@H](COS(N)(=O)=O)[C@@H](O)[C@H]3O)n2n1