Reaction Details
TargetUbiquitin-like modifier-activating enzyme 1
LigandBDBM329849
Substrate/Competitorn/a
Meas. Tech.Ubiquitin Activating Enzyme (UAE) HTRF Assay
IC50<10±n/a nM
Citation Afroze, RBharathan, ITCiavarri, JPFleming, PEGaulin, JLGirard, MLangston, SPSoucy, FWong, TYe, Y Pyrazolopyrimidinyl inhibitors of ubiquitin-activating enzyme US Patent US10202389 Publication Date 2/12/2019
 
Ubiquitin-like modifier-activating enzyme 1
Name:Ubiquitin-like modifier-activating enzyme 1
Type:PROTEIN
Mol. Mass.:117834.03
Organism:Homo sapiens (Human)
Description:ChEMBL_827630
Residue:1058
BDBM329849
NameBDBM329849
Synonyms:(rac)-((1R,2R,3S,4R)-4-(2-(5-chloro-2-(trifluoromethoxy)phenyl)pyrazolo[1,5- US9663525, Compound I-057 | US9796725, Compound I-057
TypeSmall organic molecule
Emp. Form.C19H19ClF3N5O6S
Mol. Mass.537.897
SMILESNS(=O)(=O)OC[C@H]1C[C@@H](Nc2ccnc3cc(nn23)-c2cc(Cl)ccc2OC(F)(F)F)[C@H](O)[C@@H]1O