Reaction Details
TargetGag-Pol polyprotein
LigandBDBM347147
Substrate/Competitorn/a
Meas. Tech.Anti-HIV Activity
EC50 2.30±n/a nM
Citation Yoshinaga, TNodu, K Polycyclic pyridone derivative having integrase inhibitory activity US Patent US10202404 Publication Date 2/12/2019
 
Gag-Pol polyprotein
Name:Gag-Pol polyprotein
Type:Protein
Mol. Mass.:162074.74
Organism:Human immunodeficiency virus type 1 group M subtype B (isolate HXB2)
Description:P04585
Residue:1435
BDBM347147
NameBDBM347147
Synonyms:US10202404, Compound A-18
TypeSmall organic molecule
Emp. Form.C20H16ClFN4O4S
Mol. Mass.462.882
SMILESC[C@H]1CO[C@@H]2Cn3cc(-c4nnc(Cc5cccc(Cl)c5F)s4)c(=O)c(O)c3C(=O)N12