Reaction Details
TargetGag-Pol polyprotein
LigandBDBM347240
Substrate/Competitorn/a
Meas. Tech.Anti-HIV Activity
EC50 2.20±n/a nM
Citation Yoshinaga, TNodu, K Polycyclic pyridone derivative having integrase inhibitory activity US Patent US10202404 Publication Date 2/12/2019
 
Gag-Pol polyprotein
Name:Gag-Pol polyprotein
Type:Protein
Mol. Mass.:162074.74
Organism:Human immunodeficiency virus type 1 group M subtype B (isolate HXB2)
Description:P04585
Residue:1435
BDBM347240
NameBDBM347240
Synonyms:US10202404, Compound C-14
TypeSmall organic molecule
Emp. Form.C20H17ClFN5O3S
Mol. Mass.461.897
SMILESOc1c2C(=O)N3CCCCN3Cn2cc(-c2nnc(Cc3cccc(Cl)c3F)s2)c1=O