Reaction Details
TargetGag-Pol polyprotein
LigandBDBM347248
Substrate/Competitorn/a
Meas. Tech.Anti-HIV Activity
EC50 1.20±n/a nM
Citation Yoshinaga, TNodu, K Polycyclic pyridone derivative having integrase inhibitory activity US Patent US10202404 Publication Date 2/12/2019
 
Gag-Pol polyprotein
Name:Gag-Pol polyprotein
Type:Protein
Mol. Mass.:162074.74
Organism:Human immunodeficiency virus type 1 group M subtype B (isolate HXB2)
Description:P04585
Residue:1435
BDBM347248
NameBDBM347248
Synonyms:US10202404, Compound C-23
TypeSmall organic molecule
Emp. Form.C19H17F2N5O3S
Mol. Mass.433.432
SMILESCCN1N(C)Cn2cc(-c3nnc(Cc4ccc(F)cc4F)s3)c(=O)c(O)c2C1=O