Reaction Details
TargetGag-Pol polyprotein
LigandBDBM347252
Substrate/Competitorn/a
Meas. Tech.Anti-HIV Activity
EC50 2.00±n/a nM
Citation Yoshinaga, TNodu, K Polycyclic pyridone derivative having integrase inhibitory activity US Patent US10202404 Publication Date 2/12/2019
 
Gag-Pol polyprotein
Name:Gag-Pol polyprotein
Type:Protein
Mol. Mass.:162074.74
Organism:Human immunodeficiency virus type 1 group M subtype B (isolate HXB2)
Description:P04585
Residue:1435
BDBM347252
NameBDBM347252
Synonyms:US10202404, Compound C-27
TypeSmall organic molecule
Emp. Form.C22H23F2N5O5S
Mol. Mass.507.51
SMILESCOCCN1Cn2cc(-c3nnc(Cc4ccc(F)cc4F)s3)c(=O)c(O)c2C(=O)N1CCOC